{"text_format":"3","workbook":"xlsx","n_sheets":6,"sheets":["questinario","Bearbeitung","Berechnung","guida","Sachbearbeiter","Textkonserven"],"not_rendered":{"images":3,"defined_names":4,"comments":1},"read":"whole","date_system":"1900"}

{"sheet":"questinario","index":0,"n_rows":114,"n_cols":18,"rows_kept":114,"merged":[[0,0,1,0],[0,1,0,2],[0,4,0,13],[1,1,1,13],[2,1,2,3],[2,11,2,13],[3,11,3,13],[4,0,10,0],[4,11,4,13],[5,10,5,13],[6,1,6,3],[6,4,6,5],[7,10,7,13],[8,10,8,13],[9,10,9,13],[10,1,10,13],[11,1,11,13],[12,2,12,13],[13,2,13,4],[13,5,13,7],[13,9,13,13],[14,2,14,4],[14,5,14,13],[15,2,15,4],[15,7,15,13],[16,2,16,4],[16,5,16,6],[16,9,16,13],[17,2,17,4],[17,5,17,9],[17,10,17,12],[18,2,18,4],[18,11,18,12],[19,2,19,4],[19,7,19,9],[19,12,19,13],[21,2,21,13],[22,2,22,4],[22,6,22,13],[25,2,25,5],[25,6,25,7],[25,10,25,11],[25,12,25,13],[26,2,26,9],[26,10,26,11],[26,12,26,13],[27,2,27,9],[27,10,27,11],[27,12,27,13],[28,2,28,9],[28,10,28,11],[28,12,28,13],[29,2,29,9],[29,10,29,11],[29,12,29,13],[30,2,30,9],[30,10,30,11],[30,12,30,13],[31,2,31,9],[31,10,31,11],[31,12,31,13],[32,2,32,4],[32,7,32,9],[32,12,32,13],[34,1,34,13],[35,2,35,7],[36,2,36,13],[37,2,37,13],[38,2,38,4],[38,7,38,9],[38,12,38,13],[40,1,40,12],[40,13,41,13],[41,2,41,12],[42,3,42,12],[43,3,43,12],[44,3,44,12],[45,3,45,12],[46,3,46,12],[47,3,47,12],[48,3,48,12],[49,3,49,12],[50,1,50,10],[51,2,51,12],[52,3,52,12],[53,3,53,12],[54,3,54,12],[55,3,55,12],[56,3,56,12],[57,3,57,12],[58,3,58,12],[59,3,59,12],[71,3,71,12],[72,3,72,12],[73,3,73,12],[74,3,74,12],[75,3,75,12],[76,3,76,12],[77,1,77,12],[78,2,78,12],[79,3,79,12],[80,3,80,12],[81,3,81,12],[82,3,82,4],[82,5,82,12],[83,3,83,4],[83,5,83,12],[84,3,84,4],[84,5,84,12],[85,3,85,4],[85,5,85,12],[86,3,86,12],[87,3,87,12],[88,1,88,12],[89,2,89,12],[90,3,90,4],[90,5,90,12],[91,3,91,4],[91,5,91,12],[92,3,92,4],[92,5,92,12],[93,3,93,4],[93,5,93,12],[94,3,94,4],[94,5,94,12],[95,3,95,4],[95,5,95,12],[96,3,96,4],[96,5,96,12],[97,3,97,4],[97,5,97,12],[98,3,98,4],[98,5,98,12],[99,3,99,4],[99,5,99,12],[100,3,100,4],[100,5,100,12],[101,3,101,4],[101,5,101,12],[102,3,102,4],[102,5,102,12],[103,3,103,4],[103,5,103,12],[104,3,104,4],[104,5,104,12],[105,3,105,4],[105,5,105,12],[106,3,106,12],[107,1,107,12],[108,1,108,10],[109,1,109,13],[111,1,111,13],[113,1,113,3],[113,4,113,5],[113,7,113,8],[113,10,113,11]]}
[{"$nulls":4},"Steuerverwaltung des Kantons Graubünden  \nAdministraziun da taglia dal Chantun Grischun     \nAmministrazione imposte del Cantone dei Grigioni "]
[null,"Abteilung Rechnungswesen, Steinbruchstrasse 18, CH-7001 Chur    "]
[{"$f":"Bearbeitung!A3","v":"rw"},"Incaricato/a:",null,null,{"$f":"VLOOKUP($A$3,Sachbearbeiter!$A:$E,2,FALSE)","v":"Rechnungswesen"},{"$nulls":5},"Tel:",{"$f":"VLOOKUP($A$3,Sachbearbeiter!$A:$E,3,FALSE)","v":"081 257 33 18"}]
[{"$f":"Bearbeitung!A4","v":"e"},"Mail:",null,null,{"$f":"VLOOKUP($A$3,Sachbearbeiter!$A:$E,5,FALSE)","v":"rechnungswesen@stv.gr.ch"},{"$nulls":5},"Fax:",{"$f":"VLOOKUP($A$3,Sachbearbeiter!$A:$E,4,FALSE)","v":"081 257 20 14"}]
[{"$nulls":10},"Data:"]
[]
[null,{"$f":"VLOOKUP(A4,Textkonserven!A:D,4,FALSE)","v":"Registro n."},{"$nulls":8},"Steuerverwaltung des Kant. Graubünden"]
[{"$nulls":10},{"$f":"\"z.H.\" &\" \"&E3","v":"z.H. Rechnungswesen"}]
[{"$nulls":10},"Steinbruchstrasse 18"]
[{"$nulls":10},"7001 Chur"]
[null,{"$f":"VLOOKUP(A4,Textkonserven!A:B,2,FALSE)","v":"Verifica della situazione patrimoniale e di reddito in relazione a una domanda di condono per crediti fiscali (DCCF)"}]
[]
[null,"1.",{"$f":"VLOOKUP(A4,Textkonserven!A:I,9,FALSE)","v":"Dati personali contribuente"}]
[null,null,"Cognome / nome",{"$nulls":5},"/"]
[null,null,"Indirizzo"]
[null,null,"NPA / Luogo",{"$nulls":3},"/"]
[null,null,"Data di nascita"]
[null,null,"Datore di lavoro",null,null," ",{"$nulls":4},"/     Luogo di lavoro "]
[null,null,"Volume di lavoro in %"]
[]
{"$rows_left_out":95}
{"sheet":"Bearbeitung","index":1,"n_rows":113,"n_cols":16,"rows_kept":113,"hidden":true,"merged":[[0,0,1,0],[0,1,0,2],[0,4,0,13],[1,1,1,13],[2,11,2,13],[3,11,3,13],[4,0,10,0],[4,11,4,13],[5,10,5,13],[6,1,6,3],[6,4,6,5],[6,10,6,13],[7,10,7,13],[8,10,8,13],[9,10,9,13],[10,1,10,13],[11,1,11,13],[12,2,12,13],[13,2,13,4],[13,5,13,7],[13,9,13,13],[14,2,14,4],[14,5,14,13],[15,2,15,4],[15,7,15,13],[16,2,16,4],[16,5,16,6],[16,9,16,13],[17,2,17,4],[17,5,17,9],[17,10,17,12],[18,2,18,4],[18,11,18,12],[19,2,19,4],[19,7,19,9],[19,12,19,13],[21,2,21,13],[22,2,22,4],[22,6,22,13],[23,2,23,5],[23,6,23,7],[23,10,23,11],[23,12,23,13],[24,2,24,9],[24,10,24,11],[24,12,24,13],[25,2,25,9],[25,10,25,11],[25,12,25,13],[26,2,26,9],[26,10,26,11],[26,12,26,13],[27,2,27,9],[27,10,27,11],[27,12,27,13],[28,2,28,9],[28,10,28,11],[28,12,28,13],[29,2,29,9],[29,10,29,11],[29,12,29,13],[30,2,30,4],[30,7,30,9],[30,12,30,13],[32,1,32,13],[33,2,33,7],[34,2,34,13],[35,2,35,13],[36,2,36,4],[36,7,36,9],[36,12,36,13],[38,1,38,12],[38,13,39,13],[39,2,39,12],[40,3,40,12],[41,3,41,12],[42,3,42,12],[43,3,43,12],[44,3,44,12],[45,3,45,12],[46,3,46,12],[47,3,47,12],[48,1,48,10],[49,2,49,12],[50,3,50,12],[51,11,51,12],[52,11,52,12],[53,3,53,7],[53,11,53,12],[54,4,54,5],[54,6,54,7],[54,11,54,12],[55,3,55,12],[56,3,56,12],[57,3,57,12],[58,3,58,12],[59,3,59,12],[60,3,60,12],[61,3,61,12],[73,3,73,12],[74,3,74,12],[75,3,75,12],[76,3,76,12],[77,3,77,12],[78,3,78,12],[79,1,79,12],[80,2,80,12],[81,3,81,12],[82,3,82,12],[83,3,83,12],[84,3,84,4],[84,5,84,12],[85,3,85,4],[85,5,85,12],[86,3,86,4],[86,5,86,12],[87,3,87,4],[87,5,87,12],[88,3,88,12],[89,3,89,12],[90,1,90,12],[91,2,91,12],[92,3,92,4],[92,5,92,12],[93,3,93,4],[93,5,93,12],[94,3,94,4],[94,5,94,12],[95,3,95,4],[95,5,95,12],[96,3,96,4],[96,5,96,12],[97,3,97,4],[97,5,97,12],[98,3,98,4],[98,5,98,12],[99,3,99,4],[99,5,99,12],[100,3,100,4],[100,5,100,12],[101,3,101,4],[101,5,101,12],[102,3,102,4],[102,5,102,12],[103,3,103,4],[103,5,103,12],[104,3,104,4],[104,5,104,12],[105,3,105,4],[105,5,105,12],[106,3,106,4],[106,5,106,12],[107,3,107,4],[107,5,107,12],[108,3,108,12],[109,1,109,12],[110,1,110,10],[112,1,112,3],[112,4,112,13],[113,1,113,13]]}
["Sachbearbeiter",{"$nulls":3},"Steuerverwaltung des Kantons Graubünden  \nAdministraziun da taglia dal Chantun Grischun     \nAmministrazione imposte del Cantone dei Grigioni ",{"$nulls":9},"Bemerkungen intern, ohne Anzeige an den Kunden"]
[null,"Abteilung Rechnungswesen, Steinbruchstrasse 18, CH-7001 Chur    "]
["rw",{"$f":"questinario!B3:D3","v":"Incaricato/a:"},null,null,{"$f":"VLOOKUP($A$3,Sachbearbeiter!$A:$E,2,FALSE)","v":"Rechnungswesen"},{"$nulls":5},"Tel:",{"$f":"VLOOKUP($A$3,Sachbearbeiter!$A:$E,3,FALSE)","v":"081 257 33 18"}]
["e","Mail:",null,null,{"$f":"VLOOKUP($A$3,Sachbearbeiter!$A:$E,5,FALSE)","v":"rechnungswesen@stv.gr.ch"},{"$nulls":5},"Fax:",{"$f":"VLOOKUP($A$3,Sachbearbeiter!$A:$E,4,FALSE)","v":"081 257 20 14"}]
["Sachgebiet: u=URP / v=VS / e= Erlasss",{"$nulls":9},{"$f":"questinario!K5","v":"Data:"},{"$f":"IF(questinario!L5:N5<>0,questinario!L5:N5,\"\")","v":""}]
[]
[null,{"$f":"VLOOKUP(A4,Textkonserven!A:D,4,FALSE)","v":"Registro n."},null,null,{"$f":"IF(questinario!E7:F7<>0,questinario!E7:F7,\"\")","v":""},{"$nulls":5},{"$f":"questinario!K7","v":"Steuerverwaltung des Kant. Graubünden"}]
[{"$nulls":10},{"$f":"questinario!K8","v":"z.H. Rechnungswesen"}]
[{"$nulls":10},{"$f":"questinario!K9","v":"Steinbruchstrasse 18"}]
[{"$nulls":10},{"$f":"questinario!K10","v":"7001 Chur"}]
[null,{"$f":"VLOOKUP(A4,Textkonserven!A:B,2,FALSE)","v":"Verifica della situazione patrimoniale e di reddito in relazione a una domanda di condono per crediti fiscali (DCCF)"}]
[]
[null,"1.",{"$f":"VLOOKUP(A4,Textkonserven!A:I,9,FALSE)","v":"Dati personali contribuente"}]
[null,null,{"$f":"questinario!C14","v":"Cognome / nome"},null,null,{"$f":"IF(questinario!F14:H14<>0,questinario!F14:H14,\"\")","v":""},null,null,"/",{"$f":"IF(questinario!J14:N14<>0,questinario!J14:N14,\"\")","v":""}]
[null,null,{"$f":"questinario!C15","v":"Indirizzo"},null,null,{"$f":"IF(questinario!F15:N15<>0,questinario!F15:N15,\"\")","v":""}]
[null,null,{"$f":"questinario!C16","v":"NPA / Luogo"},null,null,{"$f":"IF(questinario!F16<>0,questinario!F16,\"\")","v":""},"/",{"$f":"IF(questinario!H16:N16<>0,questinario!H16:N16,\"\")","v":""}]
[null,null,{"$f":"questinario!C17","v":"Data di nascita"},null,null,{"$f":"IF(questinario!F17:G17<>0,questinario!F17:G17,\"\")","v":""}]
[null,null,{"$f":"questinario!C18","v":"Datore di lavoro"},null,null,{"$f":"IF(questinario!F18:J18<>0,questinario!F18:J18,\"\")","v":" "},{"$nulls":4},{"$f":"questinario!K18:M18","v":"/     Luogo di lavoro "},null,null,{"$f":"IF(questinario!N18:N18<>0,questinario!N18:N18,\"\")","v":""}]
[null,null,{"$f":"questinario!C19","v":"Volume di lavoro in %"},null,null,{"$f":"IF(questinario!F19<>0,questinario!F19,\"\")","v":""}]
[]
{"$rows_left_out":94}
{"sheet":"Berechnung","index":2,"n_rows":66,"n_cols":15,"rows_kept":66,"hidden":true,"merged":[[0,0,1,0],[0,4,0,13],[1,1,1,13],[2,11,2,13],[3,11,3,13],[4,11,4,13],[5,1,5,13],[7,2,7,13],[8,2,8,4],[8,5,8,6],[8,12,8,13],[9,2,9,4],[9,5,9,13],[10,2,10,4],[10,5,10,13],[11,2,11,4],[11,7,11,13],[12,2,12,4],[12,5,12,6],[12,7,12,9],[12,10,12,13],[13,2,13,4],[13,5,13,9],[13,10,13,12],[14,2,14,4],[14,11,14,12],[15,2,15,4],[15,7,15,9],[15,12,15,13],[17,2,17,13],[18,2,18,4],[18,6,18,13],[19,2,19,4],[19,7,19,9],[19,12,19,13],[21,1,21,12],[21,13,22,13],[22,2,22,12],[23,3,23,12],[24,3,24,12],[25,3,25,12],[26,3,26,12],[27,3,27,12],[28,3,28,12],[29,3,29,12],[30,3,30,12],[31,1,31,12],[34,2,34,12],[35,3,35,12],[36,11,36,12],[37,11,37,12],[38,3,38,7],[38,11,38,12],[39,4,39,5],[39,6,39,7],[39,11,39,12],[40,3,40,12],[41,3,41,12],[42,3,42,12],[43,3,43,12],[44,3,44,12],[45,3,45,12],[46,3,46,12],[47,3,47,12],[48,3,48,12],[49,3,49,12],[50,3,50,12],[51,3,51,12],[52,3,52,12],[53,1,53,12],[54,1,54,12],[56,1,56,7],[57,3,57,6],[58,3,58,6],[59,3,59,6],[60,3,60,6],[61,1,61,7],[64,1,64,3],[64,4,64,13],[65,1,65,13]]}
[{"$nulls":4},"Steuerverwaltung des Kantons Graubünden  \nAdministraziun da taglia dal Chantun Grischun     \nAmministrazione imposte del Cantone dei Grigioni ",{"$nulls":9},"Bemerkungen intern, ohne Anzeige an den Kunden"]
[null,"Abteilung Rechnungswesen, Steinbruchstrasse 18, CH-7001 Chur    "]
[null,{"$f":"Bearbeitung!B3","v":"Incaricato/a:"},null,null,{"$f":"Bearbeitung!E3","v":"Rechnungswesen"},{"$nulls":5},"Tel:",{"$f":"Bearbeitung!L3","v":"081 257 33 18"}]
[null,"Mail:",null,null,{"$f":"Bearbeitung!E4","v":"rechnungswesen@stv.gr.ch"},{"$nulls":5},"Fax:",{"$f":"Bearbeitung!L4","v":"081 257 20 14"}]
[{"$nulls":10},{"$f":"Bearbeitung!K5","v":"Data:"},{"$f":"Bearbeitung!L5","v":""}]
[null,{"$f":"VLOOKUP(Bearbeitung!A4,Textkonserven!A:C,3,FALSE)","v":"Calcolo della situazione patrimoniale e di reddito in relazione a una domanda di condono per crediti fiscali (DCCF)"}]
[]
[null,"1.",{"$f":"Bearbeitung!C13","v":"Dati personali contribuente"}]
[null,null,{"$f":"Bearbeitung!B7","v":"Registro n."},null,null,{"$f":"IF(Bearbeitung!E7<>\"\",Bearbeitung!E7,\"\")","v":""}]
[null,null,{"$f":"Bearbeitung!C14","v":"Cognome / nome"},null,null,{"$f":"IF(Bearbeitung!F14<>\"\",Bearbeitung!F14&\" \"&Bearbeitung!J14,\"\")","v":""}]
[null,null,{"$f":"Bearbeitung!C15","v":"Indirizzo"},null,null,{"$f":"IF(Bearbeitung!F15<>\"\",Bearbeitung!F15,\"\")","v":""}]
[null,null,{"$f":"Bearbeitung!C16","v":"NPA / Luogo"},null,null,{"$f":"IF(Bearbeitung!F16<>\"\",Bearbeitung!F16,\"\")","v":""},"/",{"$f":"IF(Bearbeitung!H16<>\"\",Bearbeitung!H16,\"\")","v":""}]
[null,null,{"$f":"Bearbeitung!C17","v":"Data di nascita"},null,null,{"$f":"IF(Bearbeitung!F17>0,Bearbeitung!F17,\"\")","v":""}]
[null,null,{"$f":"Bearbeitung!C18","v":"Datore di lavoro"},null,null,{"$f":"IF(Bearbeitung!F18<>\"\",Bearbeitung!F18,\"\")","v":" "},{"$nulls":4},{"$f":"Bearbeitung!K18","v":"/     Luogo di lavoro "},null,null,{"$f":"IF(Bearbeitung!N18<>\"\",Bearbeitung!N18,\"\")","v":""}]
[null,null,{"$f":"Bearbeitung!C19","v":"Volume di lavoro in %"},null,null,{"$f":"IF(Bearbeitung!F19<>\"\",Bearbeitung!F19,\"\")","v":""}]
[]
[]
[null,"2.",{"$f":"Bearbeitung!C22","v":"Numero di persone che vivono nella stessa economia domestica"}]
[{"$f":"Bearbeitung!A23","v":0},null,{"$f":"Bearbeitung!C23","v":"Numero di adulti:"},null,null,{"$f":"Bearbeitung!F23","v":""},{"$nulls":8},{"$f":"IF(Bearbeitung!O23<>\"\",Bearbeitung!O23,\"\")","v":""}]
[]
{"$rows_left_out":47}
{"sheet":"guida","index":3,"n_rows":46,"n_cols":5,"rows_kept":46,"merged":[[0,0,0,1],[0,3,0,4],[1,0,1,4],[3,0,3,4],[4,0,4,4],[5,0,5,4],[6,1,6,4],[7,1,7,4],[8,1,8,3],[9,0,9,4],[10,1,10,4],[11,1,11,4],[12,1,12,4],[13,1,13,4],[14,1,14,4],[15,1,15,4],[16,1,16,4],[17,1,17,4],[18,1,18,4],[19,1,19,3],[20,0,20,4],[21,1,21,3],[22,1,22,3],[23,1,23,3],[24,1,24,3],[25,1,25,3],[26,1,26,3],[27,1,27,3],[28,1,28,3],[29,1,29,3],[30,1,30,3],[31,1,31,3],[32,1,32,3],[33,1,33,3],[34,1,34,4],[35,1,35,3],[36,0,36,4],[37,1,37,4],[38,1,38,4],[39,1,39,4],[40,1,40,4],[41,1,41,4],[42,1,42,3],[43,0,43,4],[44,1,44,4],[45,1,45,4]]}
[{"$nulls":3},"Steuerverwaltung des Kantons Graubünden  \nAdministraziun da taglia dal Chantun Grischun     \nAmministrazione imposte del Cantone dei Grigioni "]
["Abteilung Rechnungswesen, Steinbruchstrasse 18, CH-7001 Chur    "]
[]
["Guida per la verifica della situazione patrimoniale e di reddito"]
["Per tutte le posizioni compilate nel modulo \"Verifica della situazione patrimoniale e di reddito\" devono essere inoltrati relativi giustificativi e documenti quali prove. Non è ammessa la deduzione di spese in assenza di documenti giustificativi. L'elenco sottostante (non esaustivo) comprende eventuali prove disponibili."]
["Numero di persone che vivono nella stessa economia domestica"]
["N.","Indicazioni/osservazioni"]
["2","Nomi dei figli: \nOccorre indicare i figli del contribuente che ad oggi hanno meno di 18 anni. \nI figli del partner possono essere indicati se anche il partner rende nota la sua situazione finanziaria nel presente questionario."]
[]
["Proventi mensili"]
["N.","Documentazione da inoltrare (non inviare originali)"]
["3","Dichiarazione d'imposta dell'anno precedente incl. allegati"]
["3.1","Certificato di salario dell'anno precedente incl. conteggi del salario degli ultimi 3 mesi"]
[3.2,"Giustificativi di entrata"]
[3.3,"Giustificativi di entrata"]
[3.4,"Giustificativi di entrata"]
[3.5,"Giustificativi di entrata"]
[3.6,"Giustificativi di entrata"]
[3.7,"Giustificativi di entrata"]
[]
{"$rows_left_out":27}
{"sheet":"Sachbearbeiter","index":4,"n_rows":9,"n_cols":5,"rows_kept":9,"hidden":true}
["Kurzzeichen","Sachbearbeiter","Tel.","Fax","Mail"]
["Cr","Cris Raselli","081 257 34 78","081 257 20 14","Cris.Raselli@stv.gr.ch"]
["Gr","Gladys Rösli","081 257 34 94","081 257 20 14","Gladys.Roesli@stv.gr.ch"]
["Kd","Katja Duff","081 257 34 86","081 257 20 14","Katja.Duff@stv.gr.ch"]
["Ft","Fabian Tschuor","081 257 34 96","081 257 20 14","Fabian.Tschuor@stv.gr.ch"]
["Ps","Pascale Schumacher ","081 257 34 98","081 257 20 14","Pascale.Schumacher@stv.gr.ch"]
["Gg","Gion Giovannoni","081 257 34 70","081 257 20 14","Gion.Giovannoni@stv.gr.ch"]
["As","Alexander Schlegel","081 257 34 62","081 257 20 14","Alexander.Schlegel@stv.gr.ch"]
["Rw","Rechnungswesen","081 257 33 18","081 257 20 14","rechnungswesen@stv.gr.ch"]

{"sheet":"Textkonserven","index":5,"n_rows":5,"n_cols":11,"rows_kept":5,"hidden":true}
["Sachgebiet \na=amtl. Verteidig.\nu=URP\nv=VS\nE=Erlass","Dokumententitel Fragebogen","Dokumententitel Berechnungsformular","Referenz","Spaltentitel","Berechnungsübersicht Titel in CHF","Berechnungsübersicht Titel in %","Berechnungsüberisicht Titel Anteil am Manko","Überschrift \"Personalien\"","Fusszeile bzgl. \"Forderungsverzicht\" Zeile-1","Fusszeile bzgl. \"Forderungsverzicht\" Zeile-2"]
["a","Verifica del patrimonio e dei proventi in relazione al rimborso delle spese per la difesa d'ufficio","Calcolo del patrimonio e dei proventi in relazione al rimborso delle spese per la difesa d'ufficio","Dossier no.","Richiedente difesa d'ufficio \nCHF","Quota del richiedente della difesa d'ufficio in CHF","Quota del richiedente della difesa d'ufficio in %","Quota dell'avanzo collettivo del richiedente della difesa d'ufficio in CHF, rispettivamente disavanzo in relazione al reddito","Dati personali del richiedente della difesa d'ufficio"]
["u","Verifica della situazione patrimoniale e di reddito in relazione al rimborso delle spese per il patrocinio gratuito (RSPG)","Calcolo della situazione patrimoniale e di reddito in relazione al rimborso delle spese per il patrocinio gratuito (RSPG)","Dossier n.","parte tenuta RSPG CHF","Quota della \nRSPG in CHF","Quota della RSPG \nin %","Quota della RSPG in CHF all'eccedenza risp. all'ammanco comune in rapporto al reddito","Dati personali parte tenuta a RSPG"]
["v","Verifica della situazione patrimoniale e di reddito in relazione all'esecuzione di attestati di carenza di beni (ACB)","Calcolo della situazione patrimoniale e di reddito in relazione all'esecuzione di attestati di carenza di beni (ACB)","Registro n.","Titolare dell'ACB CHF","Quota dell'ACB\nin CHF","Quota dell'ACB\nin CHF","Quota della parte contro la quale è stato emesso un ACB in CHF all'eccedenza risp. all'ammanco comune in rapporto al reddito","Dati personali parte ACB","Rinunciano i creditori (nono privilegiati) ai loro crediti? Sì / No:","(Se sì, allegare piano di risanamento e documenti giustificativi) "]
["e","Verifica della situazione patrimoniale e di reddito in relazione a una domanda di condono per crediti fiscali (DCCF)","Calcolo della situazione patrimoniale e di reddito in relazione a una domanda di condono per crediti fiscali (DCCF)","Registro n.","Contribuente CHF","Quota contribuente \nin CHF","Quota contribuente \nin %","Quota del contribuente in CHF all'eccedenza risp. all'ammanco comune in rapporto al reddito","Dati personali contribuente","Rinunciano i creditori (nono privilegiati) ai loro crediti? Sì / No:","(Se sì, allegare piano di risanamento e documenti giustificativi) "]